Target
Cathepsin K
Ligand
BDBM50154171
Substrate
Meas. Tech.
ChEMBL_304938 (CHEMBL826967)
IC50
22±n/a nM
Citation
 Tavares, FXDeaton, DNMiller, ABMiller, LRWright, LLZhou, HQ Potent and selective ketoamide-based inhibitors of cysteine protease, cathepsin K. J Med Chem 47:5049-56 (2004)  
Target
Name:
Cathepsin K
Synonyms:
CATK_HUMAN CTSO Cathepsin O Cathepsin X
Type:
Enzyme
Mol. Mass.:
36975.68
Organism:
Homo sapiens (Human)
Description:
P43235
Residue:
329
  
Inhibitor
Name:
BDBM50154171
Synonyms:
CHEMBL184727 | [1-(5-Phenyl-1H-pyrazol-3-ylaminooxalyl)-pentyl]-carbamic acid 1-ethyl-cyclopentylmethyl ester
Type:
Small organic molecule
Emp. Form.:
C25H34N4O4
Mol. Mass.:
454.5619
SMILES:
CCCC[C@H](NC(=O)OCC1(CC)CCCC1)C(=O)C(=O)Nc1cc(n[nH]1)-c1ccccc1
: