Target
5-hydroxytryptamine receptor 6
Ligand
BDBM50155141
Substrate
Meas. Tech.
ChEMBL_303107 (CHEMBL829617)
Ki
42±n/a nM
Citation
 Bernotas, RLenicek, SAntane, SZhang, GMSmith, DCoupet, JHarrison, BSchechter, LE 1-(2-Aminoethyl)-3-(arylsulfonyl)-1H-indoles as novel 5-HT6 receptor ligands. Bioorg Med Chem Lett 14:5499-502 (2004)  
Target
Name:
5-hydroxytryptamine receptor 6
Synonyms:
5-HT-6 5-hydroxytryptamine receptor 6 (5-HT-6) 5-hydroxytryptamine receptor 6 (5HT6) HTR6 Serotonin 6 (5-HT6) receptor | Serotonin Receptor 6
Type:
G Protein-Coupled Receptor (GPCR)
Mol. Mass.:
46968.43
Organism:
Homo sapiens (Human)
Description:
P50406
Residue:
440
  
Inhibitor
Name:
BDBM50155141
Synonyms:
CHEMBL184671 | [2-(3-Benzenesulfonyl-6-chloro-indol-1-yl)-ethyl]-dimethyl-amine
Type:
Small organic molecule
Emp. Form.:
C18H19ClN2O2S
Mol. Mass.:
362.874
SMILES:
CN(C)CCn1cc(c2ccc(Cl)cc12)S(=O)(=O)c1ccccc1
: