Target
Sodium-dependent serotonin transporter
Ligand
BDBM50106856
Substrate
Meas. Tech.
ChEMBL_303502 (CHEMBL839974)
Ki
4.02±n/a nM
Citation
 Peng, XZhang, AKula, NSBaldessarini, RJNeumeyer, JL Synthesis and amine transporter affinities of novel phenyltropane derivatives as potential positron emission tomography (PET) imaging agents. Bioorg Med Chem Lett 14:5635-9 (2004)  
Target
Name:
Sodium-dependent serotonin transporter
Synonyms:
5-HT Transporter 5HT transporter Anandamid membrane transporter, AMT Monoamine transporters; Norepinephrine & serotonin Slc6a4 Sodium-dependent serotonin transporter (SERT) | imipramine receptor
Type:
Multi-pass membrane protein
Mol. Mass.:
70168.43
Organism:
Rattus norvegicus (rat)
Description:
P31652
Residue:
630
  
Inhibitor
Name:
BDBM50106856
Synonyms:
3-(4-Iodo-phenyl)-8-methyl-8-aza-bicyclo[3.2.1]octane-2-carboxylic acid 2-fluoro-ethyl ester | CHEMBL318961
Type:
Small organic molecule
Emp. Form.:
C17H21FINO2
Mol. Mass.:
417.257
SMILES:
CN1C2CCC1C(C(C2)c1ccc(I)cc1)C(=O)OCCF
: