Target
Integrin alpha-V/beta-5
Ligand
BDBM50155809
Substrate
Meas. Tech.
ChEMBL_305553 (CHEMBL828572)
IC50
1000±n/a nM
Citation
 Ghosh, SSantulli, RJKinney, WADecorte, BLLiu, LLewis, JMProost, JCLeo, GCMasucci, JHageman, WEThompson, ASChen, IKawahama, RTuman, RWGalemmo, RAJohnson, DLDamiano, BPMaryanoff, BE 1,2,3,4-Tetrahydroquinoline-containing alphaVbeta3 integrin antagonists with enhanced oral bioavailability. Bioorg Med Chem Lett 14:5937-41 (2004)  
Target
Name:
Integrin alpha-V/beta-5
Synonyms:
ITGAV/ITGB5 | Integrin beta-5/Vitronectin receptor alpha
Type:
Enzyme
Mol. Mass.:
Description:
Components:
This complex has 2 components.
Component 1
Name:
Integrin alpha-V
Synonyms:
ITAV_HUMAN Integrin alpha-V/alpha-5 VNRA Vitronectin receptor | Vitronectin receptor subunit alpha
Type:
PROTEIN
Mol. Mass.:
116024.92
Organism:
Homo sapiens (Human)
Description:
ChEMBL_582336
Residue:
1048
  
Component 2
Name:
Integrin beta-5
Synonyms:
ITB5_HUMAN | ITGB5
Type:
PROTEIN
Mol. Mass.:
88047.37
Organism:
Homo sapiens (Human)
Description:
EBI_10915
Residue:
799
  
Inhibitor
Name:
BDBM50155809
Synonyms:
(R)-4-[1-(3-5,6,7,8-Tetrahydro-[1,8]naphthyridin-2-yl-propionyl)-piperidin-4-yl]-3-(5,6,7,8-tetrahydro-quinolin-3-yl)-butyric acid | CHEMBL187014
Type:
Small organic molecule
Emp. Form.:
C29H38N4O3
Mol. Mass.:
490.637
SMILES:
OC(=O)C[C@@H](CC1CCN(CC1)C(=O)CCc1ccc2CCCNc2n1)c1cnc2CCCCc2c1
: