Target
Integrin alpha-V/beta-3
Ligand
BDBM50155811
Substrate
Meas. Tech.
ChEMBL_305552 (CHEMBL828571)
IC50
3.6±n/a nM
Citation
 Ghosh, SSantulli, RJKinney, WADecorte, BLLiu, LLewis, JMProost, JCLeo, GCMasucci, JHageman, WEThompson, ASChen, IKawahama, RTuman, RWGalemmo, RAJohnson, DLDamiano, BPMaryanoff, BE 1,2,3,4-Tetrahydroquinoline-containing alphaVbeta3 integrin antagonists with enhanced oral bioavailability. Bioorg Med Chem Lett 14:5937-41 (2004)  
Target
Name:
Integrin alpha-V/beta-3
Synonyms:
ITGAV/ITGB3 | Integrin beta-3/Vitronectin receptor alpha
Type:
Enzyme
Mol. Mass.:
Description:
Components:
This complex has 2 components.
Component 1
Name:
Integrin alpha-V
Synonyms:
ITAV_HUMAN Integrin alpha-V/alpha-5 VNRA Vitronectin receptor | Vitronectin receptor subunit alpha
Type:
PROTEIN
Mol. Mass.:
116024.92
Organism:
Homo sapiens (Human)
Description:
ChEMBL_582336
Residue:
1048
  
Component 2
Name:
Integrin beta-3
Synonyms:
CD_antigen=CD61 GPIIIa ITGB3 Platelet membrane glycoprotein IIIa
Type:
Protein
Mol. Mass.:
87038.91
Organism:
Homo sapiens (Human)
Description:
P05106
Residue:
788
  
Inhibitor
Name:
BDBM50155811
Synonyms:
(S)-3-({1-[4-(4,5-Dihydro-1H-imidazol-2-ylamino)-butyryl]-piperidine-4-carbonyl}-amino)-3-quinolin-3-yl-propionic acid | CHEMBL188123
Type:
Small organic molecule
Emp. Form.:
C25H32N6O4
Mol. Mass.:
480.5594
SMILES:
OC(=O)C[C@H](NC(=O)C1CCN(CC1)C(=O)CCCNC1=NCCN1)c1cnc2ccccc2c1
: