Target
Beta-secretase 1
Ligand
BDBM50155999
Substrate
Meas. Tech.
ChEMBL_303269 (CHEMBL828263)
Ki
0.300000±n/a nM
Citation
 Huang, DCaflisch, A Efficient evaluation of binding free energy using continuum electrostatics solvation. J Med Chem 47:5791-7 (2004)  
Target
Name:
Beta-secretase 1
Synonyms:
ASP2 Aspartyl protease 2 BACE1 Beta-secretase (BACE) Beta-secretase 1 (BACE 1) Beta-secretase 1 (BACE1) Beta-site amyloid precursor protein cleaving enzyme 1 Memapsin-2 beta-Secretase (BACE-1) | beta-Secretase (BACE1)
Type:
Protein
Mol. Mass.:
55755.10
Organism:
Homo sapiens (Human)
Description:
P56817
Residue:
501
  
Inhibitor
Name:
BDBM50155999
Synonyms:
CHEMBL363255 | Glu-Leu-Asp-Leu-(CHOH-CH2)-Ala-Ala-Glu-Phe
Type:
Small organic molecule
Emp. Form.:
C45H70N8O16
Mol. Mass.:
979.0813
SMILES:
CC(C)C[C@H](NC(=O)[C@@H](N)CCC(O)=O)C(=O)N[C@@H](CC(O)=O)C(=O)N[C@@H](CC(C)C)C(=O)C(O)CN[C@@H](C)C(=O)N[C@@H](C(C)C)C(=O)N[C@@H](CCC(O)=O)C(=O)N[C@@H](Cc1ccccc1)C(O)=O
: