Target
Androgen receptor
Ligand
BDBM50156504
Substrate
Meas. Tech.
ChEMBL_303250 (CHEMBL826376)
Ki
10±n/a nM
Citation
 Balog, ASalvati, MEShan, WMathur, ALeith, LWWei, DDAttar, RMGeng, JRizzo, CAWang, CKrystek, SRTokarski, JSHunt, JTGottardis, MWeinmann, R The synthesis and evaluation of [2.2.1]-bicycloazahydantoins as androgen receptor antagonists. Bioorg Med Chem Lett 14:6107-11 (2004)  
Target
Name:
Androgen receptor
Synonyms:
ANDR_HUMAN Androgen Receptor Androgen receptor/Baculoviral IAP repeat-containing protein 2 Dihydrotestosterone receptor Nuclear receptor subfamily 3 group C member 4
Type:
Receptor
Mol. Mass.:
99185.27
Organism:
Homo sapiens (Human)
Description:
CHO cells were stably transfected with human AR gene.
Residue:
920
  
Inhibitor
Name:
BDBM50156504
Synonyms:
(1S,6R,7S)-4-(4-Cyano-3-trifluoromethyl-phenyl)-3,5-dioxo-2,4,8-triaza-tricyclo[5.2.1.0*2,6*]decane-8-carboxylic acid 4-fluoro-phenyl ester | CHEMBL362566
Type:
Small organic molecule
Emp. Form.:
C22H14F4N4O4
Mol. Mass.:
474.3646
SMILES:
Oc1c2[C@@H]3C[C@@H](CN3C(=O)Oc3ccc(F)cc3)n2c(=O)n1-c1ccc(C#N)c(c1)C(F)(F)F
: