Target
Kallikrein-1
Ligand
BDBM50157087
Substrate
Meas. Tech.
ChEMBL_302558 (CHEMBL839521)
Ki
54±n/a nM
Citation
 Bruncko, MMcClellan, WJWendt, MDSauer, DRGeyer, ADalton, CRKaminski, MAWeitzberg, MGong, JDellaria, JFMantei, RZhao, XNienaber, VLStewart, KKlinghofer, VBouska, JRockway, TWGiranda, VL Naphthamidine urokinase plasminogen activator inhibitors with improved pharmacokinetic properties. Bioorg Med Chem Lett 15:93-8 (2004)  
Target
Name:
Kallikrein-1
Synonyms:
KLK1 Kallikrein 1 Kidney/pancreas/salivary gland kallikrein | Tissue kallikrein
Type:
Enzyme
Mol. Mass.:
28874.69
Organism:
Homo sapiens (Human)
Description:
P06870
Residue:
262
  
Inhibitor
Name:
BDBM50157087
Synonyms:
6-(2-Phenyl-cyclopropyl)-8-(pyrimidin-2-ylamino)-naphthalene-2-carboxamidine CHEMBL182959
Type:
Small organic molecule
Emp. Form.:
C24H21N5
Mol. Mass.:
379.457
SMILES:
NC(=N)c1ccc2cc(cc(Nc3ncccn3)c2c1)C1CC1c1ccccc1
: