Target
Trypsin
Ligand
BDBM50157088
Substrate
Meas. Tech.
ChEMBL_302473 (CHEMBL826338)
Ki
141±n/a nM
Citation
 Bruncko, MMcClellan, WJWendt, MDSauer, DRGeyer, ADalton, CRKaminski, MAWeitzberg, MGong, JDellaria, JFMantei, RZhao, XNienaber, VLStewart, KKlinghofer, VBouska, JRockway, TWGiranda, VL Naphthamidine urokinase plasminogen activator inhibitors with improved pharmacokinetic properties. Bioorg Med Chem Lett 15:93-8 (2004)  
Target
Name:
Trypsin
Synonyms:
TRYP_PIG
Type:
PROTEIN
Mol. Mass.:
24411.24
Organism:
Sus scrofa
Description:
ChEMBL_1450738
Residue:
231
  
Inhibitor
Name:
BDBM50157088
Synonyms:
6-[2-(3-Isopropoxy-phenyl)-cyclopropyl]-naphthalene-2-carboxamidine | CHEMBL182309
Type:
Small organic molecule
Emp. Form.:
C23H24N2O
Mol. Mass.:
344.4495
SMILES:
CC(C)Oc1cccc(c1)C1CC1c1ccc2cc(ccc2c1)C(N)=N
: