Target
Trypsin
Ligand
BDBM50157084
Substrate
Meas. Tech.
ChEMBL_302473 (CHEMBL826338)
Ki
96±n/a nM
Citation
 Bruncko, MMcClellan, WJWendt, MDSauer, DRGeyer, ADalton, CRKaminski, MAWeitzberg, MGong, JDellaria, JFMantei, RZhao, XNienaber, VLStewart, KKlinghofer, VBouska, JRockway, TWGiranda, VL Naphthamidine urokinase plasminogen activator inhibitors with improved pharmacokinetic properties. Bioorg Med Chem Lett 15:93-8 (2004)  
Target
Name:
Trypsin
Synonyms:
TRYP_PIG
Type:
PROTEIN
Mol. Mass.:
24411.24
Organism:
Sus scrofa
Description:
ChEMBL_1450738
Residue:
231
  
Inhibitor
Name:
BDBM50157084
Synonyms:
8-Furan-3-yl-6-styryl-naphthalene-2-carboxamidine | CHEMBL360195
Type:
Small organic molecule
Emp. Form.:
C23H18N2O
Mol. Mass.:
338.4018
SMILES:
NC(=N)c1ccc2cc(\C=C\c3ccccc3)cc(-c3ccoc3)c2c1
: