Target
Androgen receptor
Ligand
BDBM50157823
Substrate
Meas. Tech.
ChEMBL_305503 (CHEMBL831105)
IC50
68±n/a nM
Citation
 Salvati, MEBalog, AShan, WWei, DDPickering, DAttar, RMGeng, JRizzo, CAGottardis, MMWeinmann, RKrystek, SRSack, JAn, YKish, K Structure based approach to the design of bicyclic-1H-isoindole-1,3(2H)-dione based androgen receptor antagonists. Bioorg Med Chem Lett 15:271-6 (2004)  
Target
Name:
Androgen receptor
Synonyms:
ANDR_HUMAN Androgen Receptor Androgen receptor/Baculoviral IAP repeat-containing protein 2 Dihydrotestosterone receptor Nuclear receptor subfamily 3 group C member 4
Type:
Receptor
Mol. Mass.:
99185.27
Organism:
Homo sapiens (Human)
Description:
CHO cells were stably transfected with human AR gene.
Residue:
920
  
Inhibitor
Name:
BDBM50157823
Synonyms:
(2R,6S)-4-(4-Bromo-3-methyl-phenyl)-4-aza-tricyclo[5.2.2.0*2,6*]undec-8-ene-3,5-dione | CHEMBL180681
Type:
Small organic molecule
Emp. Form.:
C17H16BrNO2
Mol. Mass.:
346.218
SMILES:
Cc1cc(ccc1Br)-n1c(O)c2C3CCC(C=C3)c2c1O
: