Target
Androgen receptor
Ligand
BDBM50158064
Substrate
Meas. Tech.
ChEMBL_303055 (CHEMBL828881)
Ki
24±n/a nM
Citation
 Salvati, MEBalog, AWei, DDPickering, DAttar, RMGeng, JRizzo, CAHunt, JTGottardis, MMWeinmann, RMartinez, R Identification of a novel class of androgen receptor antagonists based on the bicyclic-1H-isoindole-1,3(2H)-dione nucleus. Bioorg Med Chem Lett 15:389-93 (2004)  
Target
Name:
Androgen receptor
Synonyms:
ANDR_HUMAN Androgen Receptor Androgen receptor/Baculoviral IAP repeat-containing protein 2 Dihydrotestosterone receptor Nuclear receptor subfamily 3 group C member 4
Type:
Receptor
Mol. Mass.:
99185.27
Organism:
Homo sapiens (Human)
Description:
CHO cells were stably transfected with human AR gene.
Residue:
920
  
Inhibitor
Name:
BDBM50158064
Synonyms:
(2S,6R)-4-(3,5-Bis-trifluoromethyl-phenyl)-4-aza-tricyclo[5.2.1.0*2,6*]dec-8-ene-3,5-dione | CHEMBL178957
Type:
Small organic molecule
Emp. Form.:
C17H11F6NO2
Mol. Mass.:
375.2652
SMILES:
Oc1c2C3CC(C=C3)c2c(O)n1-c1cc(cc(c1)C(F)(F)F)C(F)(F)F
: