Target
Phenylethanolamine N-methyltransferase
Ligand
BDBM13025
Substrate
Meas. Tech.
ChEMBL_303174 (CHEMBL829668)
Ki
63±n/a nM
Citation
 Grunewald, GLRomero, FACriscione, KR 3-hydroxymethyl-7-(N-substituted aminosulfonyl)-1,2,3,4-tetrahydroisoquinoline inhibitors of phenylethanolamine N-methyltransferase that display remarkable potency and selectivity. J Med Chem 48:134-40 (2005)  
Target
Name:
Phenylethanolamine N-methyltransferase
Synonyms:
Noradrenaline N-methyltransferase PNMT PNMTase | Phenylethanolamine N-Methyltransferase (PNMT)
Type:
Enzyme
Mol. Mass.:
30852.66
Organism:
Homo sapiens (Human)
Description:
Residue:
282
  
Inhibitor
Name:
BDBM13025
Synonyms:
7-sulfonamide-THIQ 15 N-(4-chlorophenyl)-3-(hydroxymethyl)-1,2,3,4-tetrahydroisoquinoline-7-sulfonamide
Type:
Small organic molecule
Emp. Form.:
C16H17ClN2O3S
Mol. Mass.:
352.836
SMILES:
OCC1Cc2ccc(cc2CN1)S(=O)(=O)Nc1ccc(Cl)cc1
: