Target
Phenylethanolamine N-methyltransferase
Ligand
BDBM13027
Substrate
Meas. Tech.
ChEMBL_303174 (CHEMBL829668)
Ki
23±n/a nM
Citation
 Grunewald, GLRomero, FACriscione, KR 3-hydroxymethyl-7-(N-substituted aminosulfonyl)-1,2,3,4-tetrahydroisoquinoline inhibitors of phenylethanolamine N-methyltransferase that display remarkable potency and selectivity. J Med Chem 48:134-40 (2005)  
Target
Name:
Phenylethanolamine N-methyltransferase
Synonyms:
Noradrenaline N-methyltransferase PNMT PNMTase | Phenylethanolamine N-Methyltransferase (PNMT)
Type:
Enzyme
Mol. Mass.:
30852.66
Organism:
Homo sapiens (Human)
Description:
Residue:
282
  
Inhibitor
Name:
BDBM13027
Synonyms:
3-(hydroxymethyl)-N-(2,2,2-trifluoroethyl)-1,2,3,4-tetrahydroisoquinoline-7-sulfonamide CHEMBL366785
Type:
Small organic molecule
Emp. Form.:
C12H15F3N2O3S
Mol. Mass.:
324.319
SMILES:
OCC1Cc2ccc(cc2CN1)S(=O)(=O)NCC(F)(F)F
: