Target
Kappa-type opioid receptor
Ligand
BDBM50159174
Substrate
Meas. Tech.
ChEMBL_303490 (CHEMBL838864)
Ki
>10000±n/a nM
Citation
 Munro, TARizzacasa, MARoth, BLToth, BAYan, F Studies toward the pharmacophore of salvinorin A, a potent kappa opioid receptor agonist. J Med Chem 48:345-8 (2005)  
Target
Name:
Kappa-type opioid receptor
Synonyms:
KOR-1 OPIATE Kappa Opioid receptor Ror-d
Type:
G Protein-Coupled Receptor (GPCR)
Mol. Mass.:
42692.90
Organism:
Rattus norvegicus (rat)
Description:
P34975
Residue:
380
  
Inhibitor
Name:
BDBM50159174
Synonyms:
(3S,4aR,4bR,5R,6S,8aR,10aR)-5-Acetoxy-3-furan-3-yl-6-hydroxy-4a,8a-dimethyl-1-oxo-3,4,4a,4b,5,6,8a,9,10,10a-decahydro-1H-2-oxa-phenanthrene-8-carboxylic acid methyl ester | CHEMBL191597
Type:
Small organic molecule
Emp. Form.:
C23H28O8
Mol. Mass.:
432.4636
SMILES:
COC(=O)C1=C[C@H](O)[C@H](OC(C)=O)[C@@H]2[C@@]3(C)C[C@H](OC(=O)[C@@H]3CC[C@@]12C)c1ccoc1
: