Target
Amine oxidase [flavin-containing] A
Ligand
BDBM50159373
Substrate
Meas. Tech.
ChEMBL_302457 (CHEMBL875207)
Ki
>100000±n/a nM
Citation
 Reck, FZhou, FGirardot, MKern, GEyermann, CJHales, NJRamsay, RRGravestock, MB Identification of 4-substituted 1,2,3-triazoles as novel oxazolidinone antibacterial agents with reduced activity against monoamine oxidase A. J Med Chem 48:499-506 (2005)  
Target
Name:
Amine oxidase [flavin-containing] A
Synonyms:
AOFA_HUMAN MAO-A Monoamine oxidase Monoamine oxidase type A (MAO A) Monoamine oxidase type A (MAOA)
Type:
Protein
Mol. Mass.:
59689.53
Organism:
Homo sapiens (Human)
Description:
P21397
Residue:
527
  
Inhibitor
Name:
BDBM50159373
Synonyms:
(R)-5-[4-(2,2-Dibromo-vinyl)-[1,2,3]triazol-1-ylmethyl]-3-[4-(1,1-dioxo-1,2,3,6-tetrahydro-1lambda*6*-thiopyran-4-yl)-3-fluoro-phenyl]-oxazolidin-2-one | CHEMBL175851
Type:
Small organic molecule
Emp. Form.:
C19H17Br2FN4O4S
Mol. Mass.:
576.234
SMILES:
Fc1cc(ccc1-[#6]-1=[#6]-[#6]S(=O)(=O)[#6]-[#6]-1)-[#7]-1-[#6]-[#6@H](-[#6]-n2cc(\[#6]=[#6](/Br)Br)nn2)-[#8]-[#6]-1=O
: