Target
Alpha-1A adrenergic receptor
Ligand
BDBM50088706
Substrate
Meas. Tech.
ChEMBL_303296 (CHEMBL827429)
Ki
0.65±n/a nM
Citation
 Li, MYTsai, KCXia, L Pharmacophore identification of alpha(1A)-adrenoceptor antagonists. Bioorg Med Chem Lett 15:657-64 (2005)  
Target
Name:
Alpha-1A adrenergic receptor
Synonyms:
ADA1A_HUMAN ADRA1C Alpha 1A-adrenoceptor Alpha adrenergic receptor 1a Alpha-adrenergic receptor 1c adrenergic Alpha1 | adrenergic Alpha1C
Type:
Cell-surface receptors
Mol. Mass.:
51511.67
Organism:
Homo sapiens (Human)
Description:
P35348
Residue:
466
  
Inhibitor
Name:
BDBM50088706
Synonyms:
CHEMBL12062 RWJ-69736
Type:
Small organic molecule
Emp. Form.:
C23H36N4O3
Mol. Mass.:
416.5569
SMILES:
CC(C)Oc1ccccc1N1CCN(CCCNC(=O)CN2CCCCC2=O)CC1
: