Target
Alpha-1A adrenergic receptor
Ligand
BDBM50160161
Substrate
Meas. Tech.
ChEMBL_303296 (CHEMBL827429)
Ki
0.25±n/a nM
Citation
 Li, MYTsai, KCXia, L Pharmacophore identification of alpha(1A)-adrenoceptor antagonists. Bioorg Med Chem Lett 15:657-64 (2005)  
Target
Name:
Alpha-1A adrenergic receptor
Synonyms:
ADA1A_HUMAN ADRA1C Alpha 1A-adrenoceptor Alpha adrenergic receptor 1a Alpha-adrenergic receptor 1c adrenergic Alpha1 | adrenergic Alpha1C
Type:
Cell-surface receptors
Mol. Mass.:
51511.67
Organism:
Homo sapiens (Human)
Description:
P35348
Residue:
466
  
Inhibitor
Name:
BDBM50160161
Synonyms:
5-Methyl-3-(3-{4-[2-(2,2,2-trifluoro-ethoxy)-phenyl]-piperazin-1-yl}-propyl)-1H-pyrimidine-2,4-dione RS-100329
Type:
Small organic molecule
Emp. Form.:
C20H25F3N4O3
Mol. Mass.:
426.4327
SMILES:
Cc1c[nH]c(=O)n(CCCN2CCN(CC2)c2ccccc2OCC(F)(F)F)c1=O
: