Target
DNA polymerase III subunit alpha
Ligand
BDBM50160342
Substrate
Meas. Tech.
ChEMBL_302909 (CHEMBL830369)
Ki
47±n/a nM
Citation
 Wright, GEBrown, NCXu, WCLong, ZYZhi, CGambino, JJBarnes, MHButler, MM Active site directed inhibitors of replication-specific bacterial DNA polymerases. Bioorg Med Chem Lett 15:729-32 (2005)  
Target
Name:
DNA polymerase III subunit alpha
Synonyms:
DNA polymerase III DnaE DNA-directed DNA polymerase dnaE
Type:
Enzyme
Mol. Mass.:
125346.94
Organism:
Bacillus subtilis
Description:
Enzyme was purified from recombinant strains.
Residue:
1115
  
Inhibitor
Name:
BDBM50160342
Synonyms:
2-(3,4-Dichloro-benzylamino)-7-(4-morpholin-4-yl-butyl)-1,7-dihydro-purin-6-one | CHEMBL180999
Type:
Small organic molecule
Emp. Form.:
C20H24Cl2N6O2
Mol. Mass.:
451.35
SMILES:
Clc1ccc(CNc2nc3ncn(CCCCN4CCOCC4)c3c(=O)[nH]2)cc1Cl
: