Target
Inosine-5'-monophosphate dehydrogenase 2
Ligand
BDBM50160369
Substrate
Meas. Tech.
ChEMBL_305708 (CHEMBL827223)
IC50
188±n/a nM
Citation
 Buckley, GMDavies, NDyke, HJGilbert, PJHannah, DRHaughan, AFHunt, CAPitt, WRProfit, RHRay, NCRichard, MDSharpe, ATaylor, AJWhitworth, JMWilliams, SC Quinazolinethiones and quinazolinediones, novel inhibitors of inosine monophosphate dehydrogenase: synthesis and initial structure-activity relationships. Bioorg Med Chem Lett 15:751-4 (2005)  
Target
Name:
Inosine-5'-monophosphate dehydrogenase 2
Synonyms:
IMDH2_HUMAN IMPD 2 IMPDH-II Inosine 5'-monophosphate dehydrogenase II (IMPDH II) Inosine-5 -monophosphate dehydrogenase 2 | Inosine-5'-monophosphate dehydrogenase (IMPDH)
Type:
Enzyme
Mol. Mass.:
55806.87
Organism:
Homo sapiens (Human)
Description:
Recombinant IMPDH2 expressed in E. coli.
Residue:
514
  
Inhibitor
Name:
BDBM50160369
Synonyms:
7-Methoxy-6-oxazol-5-yl-3-(2-pyridin-4-yl-ethyl)-1H-quinazoline-2,4-dione | CHEMBL179230
Type:
Small organic molecule
Emp. Form.:
C19H16N4O4
Mol. Mass.:
364.3547
SMILES:
COc1cc2[nH]c(=O)n(CCc3ccncc3)c(=O)c2cc1-c1cnco1
: