Target
Dihydrofolate reductase
Ligand
BDBM50078461
Substrate
Meas. Tech.
ChEMBL_305461 (CHEMBL830957)
IC50
13±n/a nM
Citation
 Gangjee, ALin, X CoMFA and CoMSIA analyses of Pneumocystis carinii dihydrofolate reductase, Toxoplasma gondii dihydrofolate reductase, and rat liver dihydrofolate reductase. J Med Chem 48:1448-69 (2005)  
Target
Name:
Dihydrofolate reductase
Synonyms:
DYR_RAT Dihydrofolate reductase (DHFR) Tetrahydrofolate dehydrogenase
Type:
Enzyme
Mol. Mass.:
21638.84
Organism:
Rattus norvegicus (rat)
Description:
Residue:
187
  
Inhibitor
Name:
BDBM50078461
Synonyms:
6-{[(4-Methoxy-phenyl)-methyl-amino]-methyl}-5-methyl-pyrido[2,3-d]pyrimidine-2,4-diamine | CHEMBL264386
Type:
Small organic molecule
Emp. Form.:
C17H20N6O
Mol. Mass.:
324.3803
SMILES:
COc1ccc(cc1)N(C)Cc1cnc2nc(N)nc(N)c2c1C
: