Target
Bifunctional dihydrofolate reductase-thymidylate synthase
Ligand
BDBM50033547
Substrate
Meas. Tech.
ChEMBL_305629 (CHEMBL828662)
IC50
9.9±n/a nM
Citation
 Gangjee, ALin, X CoMFA and CoMSIA analyses of Pneumocystis carinii dihydrofolate reductase, Toxoplasma gondii dihydrofolate reductase, and rat liver dihydrofolate reductase. J Med Chem 48:1448-69 (2005)  
Target
Name:
Bifunctional dihydrofolate reductase-thymidylate synthase
Synonyms:
DHFR-TS Dihydrofolate reductase Dihydrofolate reductase; T. gondii vs rat
Type:
Enzyme
Mol. Mass.:
68757.49
Organism:
Toxoplasma gondii
Description:
Q07422
Residue:
610
  
Inhibitor
Name:
BDBM50033547
Synonyms:
6-[(2,6-Dichloro-phenylamino)-methyl]-5,6,7,8-tetrahydro-quinazoline-2,4-diamine | CHEMBL333791
Type:
Small organic molecule
Emp. Form.:
C15H17Cl2N5
Mol. Mass.:
338.235
SMILES:
Nc1nc(N)c2CC(CNc3c(Cl)cccc3Cl)CCc2n1
: