Target
Adenosine receptor A3
Ligand
BDBM50163029
Substrate
Meas. Tech.
ChEMBL_303186 (CHEMBL829680)
Ki
0.58±n/a nM
Citation
 Tchilibon, SJoshi, BVKim, SKDuong, HTGao, ZGJacobson, KA (N)-methanocarba 2,N6-disubstituted adenine nucleosides as highly potent and selective A3 adenosine receptor agonists. J Med Chem 48:1745-58 (2005)  
Target
Name:
Adenosine receptor A3
Synonyms:
A3 adenosine receptor (hA3) ADORA3 | Adenosine A3 receptor (A3AR)
Type:
G Protein-Coupled Receptor (GPCR)
Mol. Mass.:
36197.32
Organism:
Homo sapiens (Human)
Description:
P0DMS8
Residue:
318
  
Inhibitor
Name:
BDBM50163029
Synonyms:
1N-methyl-4-[2-chloro-6-(5-iodo-2-methoxybenzylamino)-9H-9-purinyl]-2,3-dihydroxy-(1S,2R,3S,4R,5S)-bicyclo[3.1.0]hexane-1-carboxamide | CHEMBL175895
Type:
Small organic molecule
Emp. Form.:
C21H22ClIN6O4
Mol. Mass.:
584.795
SMILES:
CNC(=O)[C@]12C[C@@H]1[C@H]([C@H](O)[C@@H]2O)n1cnc2c(NCc3cc(I)ccc3OC)nc(Cl)nc12
: