Target
Alpha-2A adrenergic receptor
Ligand
BDBM50024312
Substrate
Meas. Tech.
ChEMBL_302770 (CHEMBL838833)
Ki
1.6±n/a nM
Citation
 Andrés, JIAlcázar, JAlonso, JMAlvarez, RMBakker, MHBiesmans, ICid, JMDe Lucas, AIFernández, JFont, LMHens, KAIturrino, LLenaerts, IMartínez, SMegens, AAPastor, JVermote, PCSteckler, T Discovery of a new series of centrally active tricyclic isoxazoles combining serotonin (5-HT) reuptake inhibition with alpha2-adrenoceptor blocking activity. J Med Chem 48:2054-71 (2005)  
Target
Name:
Alpha-2A adrenergic receptor
Synonyms:
ADA2A_HUMAN ADRA2R Adrenergic alpha2A Alpha-2 adrenergic receptor subtype C10 Alpha-2A adrenoreceptor alpha-2A adrenergic receptor [Homo sapiens]
Type:
Enzyme
Mol. Mass.:
48979.91
Organism:
Homo sapiens (Human)
Description:
P08913
Residue:
450
  
Inhibitor
Name:
BDBM50024312
Synonyms:
CHEMBL2112970
Type:
Small organic molecule
Emp. Form.:
C25H30N4O
Mol. Mass.:
402.5319
SMILES:
[H][C@@]12CN(C)c3ccccc3C1=NO[C@H]2CN1CCN(C\C=C\c2ccccc2)CC1
: