Target
Melanocortin receptor 3
Ligand
BDBM50165927
Substrate
Meas. Tech.
ChEMBL_303606 (CHEMBL829695)
Ki
16±n/a nM
Citation
 Mayer, JPHsiung, HMFlora, DBEdwards, PSmith, DPZhang, XYGadski, RAHeiman, MLHertel, JLEmmerson, PJHusain, SO'brien, TPKahl, SDSmiley, DLZhang, LDimarchi, RDYan, LZ Discovery of a beta-MSH-derived MC-4R selective agonist. J Med Chem 48:3095-8 (2005)  
Target
Name:
Melanocortin receptor 3
Synonyms:
MC3-R MC3R_HUMAN Melanocortin receptor (M3 and M4)
Type:
Enzyme
Mol. Mass.:
36044.86
Organism:
Homo sapiens (Human)
Description:
P41968
Residue:
323
  
Inhibitor
Name:
BDBM50165927
Synonyms:
Ac-YR[CEH(pF-dF)RWC]-NH2 | CHEMBL407809
Type:
Small organic molecule
Emp. Form.:
C60H78FN19O13S2
Mol. Mass.:
1356.509
SMILES:
CC(=O)N[C@@H](Cc1ccc(O)cc1)C(=O)N[C@@H](CCCNC(N)=N)C(=O)N[C@@H]1CSSC[C@@H](NC(=O)[C@@H](Cc2c[nH]c3ccccc23)NC(=O)[C@H](CCCNC(N)=N)NC(=O)[C@H](Cc2ccc(F)cc2)NC(=O)[C@H](Cc2cnc[nH]2)NC(=O)[C@@H](CCC(O)=O)NC1=O)C(N)=O
: