Target
Cathepsin K
Ligand
BDBM50167302
Substrate
Meas. Tech.
ChEMBL_303352 (CHEMBL839667)
Ki
0.004000±n/a nM
Citation
 Barrett, DGDeaton, DNHassell, AMMcFadyen, RBMiller, ABMiller, LRPayne, JAShewchuk, LMWillard, DHWright, LL Acyclic cyanamide-based inhibitors of cathepsin K. Bioorg Med Chem Lett 15:3039-43 (2005)  
Target
Name:
Cathepsin K
Synonyms:
CATK_HUMAN CTSO Cathepsin O Cathepsin X
Type:
Enzyme
Mol. Mass.:
36975.68
Organism:
Homo sapiens (Human)
Description:
P43235
Residue:
329
  
Inhibitor
Name:
BDBM50167302
Synonyms:
(1S)-2-cyclohexyl-1-methylethyl 2-cyano-2-isobutylhydrazinecarboxylate | CHEMBL192995
Type:
Small organic molecule
Emp. Form.:
C15H27N3O2
Mol. Mass.:
281.3938
SMILES:
CC(C)CN(NC(=O)O[C@@H](C)CC1CCCCC1)C#N
: