Target
Cannabinoid receptor 2
Ligand
BDBM50170344
Substrate
Meas. Tech.
ChEMBL_302853 (CHEMBL828769)
Ki
91±n/a nM
Citation
 Huffman, JWSzklennik, PVAlmond, ABushell, KSelley, DEHe, HCassidy, MPWiley, JLMartin, BR 1-Pentyl-3-phenylacetylindoles, a new class of cannabimimetic indoles. Bioorg Med Chem Lett 15:4110-3 (2005)  
Target
Name:
Cannabinoid receptor 2
Synonyms:
CANNABINOID CB2 CB2 CB2B CNR2_HUMAN Cannabinoid CB2 receptor Cannabinoid receptor 2 (CB2R) | hCB2
Type:
G Protein-Coupled Receptor (GPCR)
Mol. Mass.:
39690.94
Organism:
Homo sapiens (Human)
Description:
P34972
Residue:
360
  
Inhibitor
Name:
BDBM50170344
Synonyms:
2-(3-Fluoro-phenyl)-1-(1-pentyl-1H-indol-3-yl)-ethanone CHEMBL189545 | JWH-312
Type:
Small organic molecule
Emp. Form.:
C21H22FNO
Mol. Mass.:
323.4039
SMILES:
CCCCCn1cc(C(=O)Cc2cccc(F)c2)c2ccccc12
: