Target
Mu-type opioid receptor
Ligand
BDBM50170676
Substrate
Meas. Tech.
ChEMBL_302757 (CHEMBL838703)
Ki
6820.0±n/a nM
Citation
 Harding, WWTidgewell, KByrd, NCobb, HDersch, CMButelman, ERRothman, RBPrisinzano, TE Neoclerodane diterpenes as a novel scaffold for mu opioid receptor ligands. J Med Chem 48:4765-71 (2005)  
Target
Name:
Mu-type opioid receptor
Synonyms:
M-OR-1 MOR-1 MUOR1 Mu opiate receptor OPRM1 hMOP | mu-type opioid receptor isoform MOR-1
Type:
G Protein-Coupled Receptor (GPCR)
Mol. Mass.:
44789.51
Organism:
Homo sapiens (Human)
Description:
P35372
Residue:
400
  
Inhibitor
Name:
BDBM50170676
Synonyms:
(2S,4aR,6aR,7R,9S,10aS,10bR)-methyl 2-(furan-3-yl)-6a,10b-dimethyl-9-(methylsulfonyloxy)-4,10-dioxo-dodecahydro-1H-benzo[f]isochromene-7-carboxylate CHEMBL365216
Type:
Small organic molecule
Emp. Form.:
C22H28O9S
Mol. Mass.:
468.517
SMILES:
COC(=O)[C@@H]1C[C@H](OS(C)(=O)=O)C(=O)[C@H]2[C@@]1(C)CC[C@H]1C(=O)O[C@@H](C[C@]21C)c1ccoc1
: