Target
Dipeptidyl peptidase 8
Ligand
BDBM50171552
Substrate
Meas. Tech.
ChEMBL_321495 (CHEMBL880436)
IC50
15±n/a nM
Citation
 Shreder, KRWong, MSCorral, SYu, ZWinn, DTWu, MHu, YNomanbhoy, TAlemayehu, SFuller, SRRosenblum, JSKozarich, JW Boro-norleucine as a P1 residue for the design of selective and potent DPP7 inhibitors. Bioorg Med Chem Lett 15:4256-60 (2005)  
Target
Name:
Dipeptidyl peptidase 8
Synonyms:
DPP8 DPRP-1 Dipeptidyl peptidase 8 (DPP-8) Dipeptidyl peptidase 8/9 Dipeptidyl peptidase VIII Prolyl dipeptidase DPP8
Type:
Enzyme
Mol. Mass.:
103342.62
Organism:
Homo sapiens (Human)
Description:
Q6V1X1
Residue:
898
  
Inhibitor
Name:
BDBM50171552
Synonyms:
(S)-2-(S)-Amino-1-(2-boron-dihydroxide-pyrrolidine)-3-methyl-butan-1-one | CHEMBL195189
Type:
Small organic molecule
Emp. Form.:
C9H19BN2O3
Mol. Mass.:
214.07
SMILES:
CC(C)[C@H](N)C(=O)N1CCC[C@@H]1B(O)O
: