Target
Aldo-keto reductase family 1 member B1
Ligand
BDBM16512
Substrate
Meas. Tech.
ChEMBL_305507 (CHEMBL831109)
IC50
9.0±n/a nM
Citation
 El-Kabbani, OCarbone, VDarmanin, COka, MMitschler, APodjarny, ASchulze-Briese, CChung, RP Structure of aldehyde reductase holoenzyme in complex with the potent aldose reductase inhibitor fidarestat: implications for inhibitor binding and selectivity. J Med Chem 48:5536-42 (2005)  
Target
Name:
Aldo-keto reductase family 1 member B1
Synonyms:
AKR1B1 ALDR_HUMAN AR Aldose Reductase (ALR2) Aldose reductase (AR)
Type:
Protein
Mol. Mass.:
35855.50
Organism:
Homo sapiens (Human)
Description:
P15121. 4LAU; 2IKI; 4LB4; 2FZD; 2FZ8; 1US0
Residue:
316
  
Inhibitor
Name:
BDBM16512
Synonyms:
(2S,4S)-6-fluoro-2',5'-dioxo-2,3-dihydrospiro[1-benzopyran-4,4'-imidazolidine]-2-carboxamide CHEMBL84446 Fidarestat (1)
Type:
Small organic molecule
Emp. Form.:
C12H10FN3O4
Mol. Mass.:
279.2239
SMILES:
NC(=O)[C@@H]1C[C@]2(NC(=O)NC2=O)c2cc(F)ccc2O1
: