Target
5-hydroxytryptamine receptor 7
Ligand
BDBM50173095
Substrate
Meas. Tech.
ChEMBL_320882 (CHEMBL884807)
Ki
342±n/a nM
Citation
 Huang, YBae, SARoth, BLLaruelle, M Synthesis of potent and selective serotonin 5-HT1B receptor ligands. Bioorg Med Chem Lett 15:4786-9 (2005)  
Target
Name:
5-hydroxytryptamine receptor 7
Synonyms:
5-HT-7 5-HT7 5-HT7S 5HT7 HTR7 | Serotonin receptor 7
Type:
G Protein-Coupled Receptor (GPCR)
Mol. Mass.:
53573.08
Organism:
Homo sapiens (Human)
Description:
P34969
Residue:
479
  
Inhibitor
Name:
BDBM50173095
Synonyms:
4-(2-Chloro-phenyl)-piperazine-1-carboxylic acid [4-methoxy-3-(4-methyl-piperazin-1-yl)-phenyl]-amide | CHEMBL370128
Type:
Small organic molecule
Emp. Form.:
C23H30ClN5O2
Mol. Mass.:
443.97
SMILES:
COc1ccc(NC(=O)N2CCN(CC2)c2ccccc2Cl)cc1N1CCN(C)CC1
: