Target
5-hydroxytryptamine receptor 2A
Ligand
BDBM50173097
Substrate
Meas. Tech.
ChEMBL_320888 (CHEMBL872387)
Ki
614±n/a nM
Citation
 Huang, YBae, SARoth, BLLaruelle, M Synthesis of potent and selective serotonin 5-HT1B receptor ligands. Bioorg Med Chem Lett 15:4786-9 (2005)  
Target
Name:
5-hydroxytryptamine receptor 2A
Synonyms:
5-HT-2 5-HT2A 5-hydroxytryptamine receptor 2A (5HT-2A) 5HT2A_HUMAN HTR2A | Serotonin receptor 2A
Type:
undefined
Mol. Mass.:
52607.65
Organism:
Homo sapiens (Human)
Description:
P28223
Residue:
471
  
Inhibitor
Name:
BDBM50173097
Synonyms:
4-(4-Trifluoromethyl-phenyl)-piperazine-1-carboxylic acid [4-methoxy-3-(4-methyl-piperazin-1-yl)-phenyl]-amide | CHEMBL196598
Type:
Small organic molecule
Emp. Form.:
C24H30F3N5O2
Mol. Mass.:
477.5225
SMILES:
COc1ccc(NC(=O)N2CCN(CC2)c2ccc(cc2)C(F)(F)F)cc1N1CCN(C)CC1
: