Target
Tyrosine-protein kinase Lck
Ligand
BDBM50175197
Substrate
Meas. Tech.
ChEMBL_328615 (CHEMBL864487)
IC50
106±n/a nM
Citation
 Burchat, ABorhani, DWCalderwood, DJHirst, GCLi, BStachlewitz, RF Discovery of A-770041, a src-family selective orally active lck inhibitor that prevents organ allograft rejection. Bioorg Med Chem Lett 16:118-22 (2005)  
Target
Name:
Tyrosine-protein kinase Lck
Synonyms:
2.7.10.2 LCK_HUMAN Leukocyte C-terminal Src kinase Lymphocyte-specific protein tyrosine kinase Protein YT16 Proto-oncogene tyrosine-protein kinase LCK T cell-specific protein-tyrosine kinase
Type:
Mol. Mass.:
57987.83
Organism:
Homo sapiens (Human)
Description:
P06239
Residue:
509
  
Inhibitor
Name:
BDBM50175197
Synonyms:
CHEMBL199369 | N-(4-(4-amino-1-(1-(tetrahydro-2H-pyran-4-yl)piperidin-4-yl)-1H-pyrazolo[3,4-d]pyrimidin-3-yl)-2-methoxyphenyl)-4-(dimethylamino)benzamide
Type:
Small organic molecule
Emp. Form.:
C31H38N8O3
Mol. Mass.:
570.6852
SMILES:
COc1cc(ccc1NC(=O)c1ccc(cc1)N(C)C)-c1nn(C2CCN(CC2)C2CCOCC2)c2ncnc(N)c12
: