Target
Tyrosine-protein kinase Fyn
Ligand
BDBM50175203
Substrate
Meas. Tech.
ChEMBL_328616 (CHEMBL864488)
IC50
32500±n/a nM
Citation
 Burchat, ABorhani, DWCalderwood, DJHirst, GCLi, BStachlewitz, RF Discovery of A-770041, a src-family selective orally active lck inhibitor that prevents organ allograft rejection. Bioorg Med Chem Lett 16:118-22 (2005)  
Target
Name:
Tyrosine-protein kinase Fyn
Synonyms:
FYN Proto-oncogene Syn SLK Src-like kinase | p59-Fyn
Type:
Enzyme
Mol. Mass.:
60762.21
Organism:
Homo sapiens (Human)
Description:
P06241
Residue:
537
  
Inhibitor
Name:
BDBM50175203
Synonyms:
CHEMBL440213 | N-(4-(4-amino-1-(1-(tetrahydro-2H-pyran-4-yl)piperidin-4-yl)-1H-pyrazolo[3,4-d]pyrimidin-3-yl)-2-methoxyphenyl)-5-cyano-1-methyl-1H-indole-2-carboxamide
Type:
Small organic molecule
Emp. Form.:
C33H35N9O3
Mol. Mass.:
605.6895
SMILES:
COc1cc(ccc1NC(=O)c1cc2cc(ccc2n1C)C#N)-c1nn(C2CCN(CC2)C2CCOCC2)c2ncnc(N)c12
: