Target
Toll-like receptor 4
Ligand
BDBM50175653
Substrate
Meas. Tech.
ChEMBL_326943 (CHEMBL854334)
IC50
250±n/a nM
Citation
 Spyvee, MRZhang, HHawkins, LDChow, JC Toll-like receptor 2 antagonists. Part 1: preliminary SAR investigation of novel synthetic phospholipids. Bioorg Med Chem Lett 15:5494-8 (2005)  
Target
Name:
Toll-like receptor 4
Synonyms:
TLR4 TLR4_HUMAN
Type:
PROTEIN
Mol. Mass.:
95675.49
Organism:
Homo sapiens (Human)
Description:
ChEMBL_1436169
Residue:
839
  
Inhibitor
Name:
BDBM50175653
Synonyms:
CHEMBL200140 | Dodecanoic acid (R)-1-{2-[(S)-3-({2-[2-carboxy-3-(4-hydroxy-phenyl)-propionylamino]-ethoxy}-hydroxy-phosphoryloxy)-2-tetradecanoylamino-propoxy]-ethyl}-octyl ester
Type:
Small organic molecule
Emp. Form.:
C51H91N2O12P
Mol. Mass.:
955.2482
SMILES:
CCCCCCCCCCCCCC(=O)N[C@@H](COCC[C@@H](CCCCCCC)OC(=O)CCCCCCCCCCC)COP(O)(=O)OCCNC(=O)C(Cc1ccc(O)cc1)C(O)=O
: