Target
Toll-like receptor 2
Ligand
BDBM50175657
Substrate
Meas. Tech.
ChEMBL_326942 (CHEMBL860291)
IC50
5200±n/a nM
Citation
 Spyvee, MRZhang, HHawkins, LDChow, JC Toll-like receptor 2 antagonists. Part 1: preliminary SAR investigation of novel synthetic phospholipids. Bioorg Med Chem Lett 15:5494-8 (2005)  
Target
Name:
Toll-like receptor 2
Synonyms:
TIL4 TLR2_HUMAN Toll-like receptor 2 (TLR2)
Type:
Protein
Mol. Mass.:
89837.58
Organism:
Homo sapiens (Human)
Description:
O60603
Residue:
784
  
Inhibitor
Name:
BDBM50175657
Synonyms:
CHEMBL380585 | N-(2-{[(R)-3-((R)-3-Dodecanoylamino-decyloxy)-2-tetradecanoylamino-propoxy]-hydroxy-phosphoryloxy}-ethyl)-2-(4-hydroxy-benzyl)-malonamic acid
Type:
Small organic molecule
Emp. Form.:
C51H92N3O11P
Mol. Mass.:
954.2634
SMILES:
CCCCCCCCCCCCCC(=O)N[C@H](COCC[C@@H](CCCCCCC)NC(=O)CCCCCCCCCCC)COP(O)(=O)OCCNC(=O)C(Cc1ccc(O)cc1)C(O)=O
: