Target
Kappa-type opioid receptor
Ligand
BDBM50175726
Substrate
Meas. Tech.
ChEMBL_328878 (CHEMBL859857)
Ki
>4652±n/a nM
Citation
 Trabanco, AAPullan, SAlonso, JMAlvarez, RMAndrés, JIBoeckx, IFernández, JGómez, AIturrino, LJanssens, FELeenaerts, JEDe Lucas, AIMatesanz, EMeert, TSteckler, T 4-Phenyl-4-[1H-imidazol-2-yl]-piperidine derivatives, a novel class of selective delta-opioid agonists. Bioorg Med Chem Lett 16:146-9 (2005)  
Target
Name:
Kappa-type opioid receptor
Synonyms:
K-OR-1 Kappa-opioid receptor (KOR) Kappa-type opioid receptor (KOR) OPIATE Kappa OPRK1 kappa opioid receptor (KOR)
Type:
G Protein-Coupled Receptor (GPCR)
Mol. Mass.:
42648.76
Organism:
Homo sapiens (Human)
Description:
P41145
Residue:
380
  
Inhibitor
Name:
BDBM50175726
Synonyms:
4-(1H-imidazol-2-yl)-N,4-diphenylpiperidine-1-carboxamide | CHEMBL199738
Type:
Small organic molecule
Emp. Form.:
C21H22N4O
Mol. Mass.:
346.4256
SMILES:
O=C(Nc1ccccc1)N1CCC(CC1)(c1ncc[nH]1)c1ccccc1
: