Target
Mu-type opioid receptor
Ligand
BDBM50175729
Substrate
Meas. Tech.
ChEMBL_328877 (CHEMBL859856)
Ki
1206±n/a nM
Citation
 Trabanco, AAPullan, SAlonso, JMAlvarez, RMAndrés, JIBoeckx, IFernández, JGómez, AIturrino, LJanssens, FELeenaerts, JEDe Lucas, AIMatesanz, EMeert, TSteckler, T 4-Phenyl-4-[1H-imidazol-2-yl]-piperidine derivatives, a novel class of selective delta-opioid agonists. Bioorg Med Chem Lett 16:146-9 (2005)  
Target
Name:
Mu-type opioid receptor
Synonyms:
M-OR-1 MOR-1 MUOR1 Mu opiate receptor OPRM1 hMOP | mu-type opioid receptor isoform MOR-1
Type:
G Protein-Coupled Receptor (GPCR)
Mol. Mass.:
44789.51
Organism:
Homo sapiens (Human)
Description:
P35372
Residue:
400
  
Inhibitor
Name:
BDBM50175729
Synonyms:
4-(1-benzyl-1H-imidazol-2-yl)-N-(4-fluorophenyl)-4-phenylpiperidine-1-carboxamide | CHEMBL201453
Type:
Small organic molecule
Emp. Form.:
C28H27FN4O
Mol. Mass.:
454.5386
SMILES:
Fc1ccc(NC(=O)N2CCC(CC2)(c2nccn2Cc2ccccc2)c2ccccc2)cc1
: