Target
Kappa-type opioid receptor
Ligand
BDBM50176369
Substrate
Meas. Tech.
ChEMBL_332931 (CHEMBL854075)
Ki
0.17±n/a nM
Citation
 Chu, GHGu, MCassel, JABelanger, SStabley, GJDeHaven, RNConway-James, NKoblish, MLittle, PJDeHaven-Hudkins, DLDolle, RE Novel phenylamino acetamide derivatives as potent and selective kappa opioid receptor agonists. Bioorg Med Chem Lett 16:645-8 (2005)  
Target
Name:
Kappa-type opioid receptor
Synonyms:
K-OR-1 Kappa-opioid receptor (KOR) Kappa-type opioid receptor (KOR) OPIATE Kappa OPRK1 kappa opioid receptor (KOR)
Type:
G Protein-Coupled Receptor (GPCR)
Mol. Mass.:
42648.76
Organism:
Homo sapiens (Human)
Description:
P41145
Residue:
380
  
Inhibitor
Name:
BDBM50176369
Synonyms:
CHEMBL201884 | N-((S)-2-((S)-3-hydroxypyrrolidin-1-yl)-1-phenylethyl)-N-methyl-2-(phenylamino)acetamide
Type:
Small organic molecule
Emp. Form.:
C21H27N3O2
Mol. Mass.:
353.458
SMILES:
CN([C@H](CN1CC[C@H](O)C1)c1ccccc1)C(=O)CNc1ccccc1
: