Target
Melanin-concentrating hormone receptor 1
Ligand
BDBM50177280
Substrate
Meas. Tech.
ChEMBL_334677 (CHEMBL853089)
IC50
4.7±n/a nM
Citation
 Ulven, TLittle, PBReceveur, JMFrimurer, TMRist, ONørregaard, PKHögberg, T 6-Acylamino-2-amino-4-methylquinolines as potent melanin-concentrating hormone 1 receptor antagonists: structure-activity exploration of eastern and western parts. Bioorg Med Chem Lett 16:1070-5 (2006)  
Target
Name:
Melanin-concentrating hormone receptor 1
Synonyms:
G-protein coupled receptor 24 MCH receptor 1 MCH-R1 MCHR-1 MCHR1_HUMAN Melanin-Concentrating Hormone Receptor 1 (MCH1R) Melanin-concentrating hormone receptor 1 (MCH-1) Melanin-concentrating hormone receptor 1 (MCHR-1) SLC-1 Somatostatin receptor-like protein
Type:
G Protein-Coupled Receptor (GPCR)
Mol. Mass.:
45976.27
Organism:
Homo sapiens (Human)
Description:
Membranes from CHO-K1 cells stably expressing human MCH1R were used in assays.
Residue:
422
  
Inhibitor
Name:
BDBM50177280
Synonyms:
CHEMBL203699 | N-(2-(3-(dimethylamino)-2,2-dimethylpropylamino)-4-methylquinolin-6-yl)-2-(4-(trifluoromethoxy)phenoxy)acetamide
Type:
Small organic molecule
Emp. Form.:
C26H31F3N4O3
Mol. Mass.:
504.5445
SMILES:
CN(C)CC(C)(C)CNc1cc(C)c2cc(NC(=O)COc3ccc(OC(F)(F)F)cc3)ccc2n1
: