Target
D(3) dopamine receptor
Ligand
BDBM50177348
Substrate
Meas. Tech.
ChEMBL_331690 (CHEMBL862890)
Ki
5.4±n/a nM
Citation
 Geneste, HBackfisch, GBraje, WDelzer, JHaupt, AHutchins, CWKing, LLKling, ATeschendorf, HJUnger, LWernet, W Synthesis and SAR of highly potent and selective dopamine D(3)-receptor antagonists: 1H-pyrimidin-2-one derivatives. Bioorg Med Chem Lett 16:490-4 (2005)  
Target
Name:
D(3) dopamine receptor
Synonyms:
DOPAMINE D3 DRD3_HUMAN Dopamine D3 receptor (D3) Dopamine receptor Dopamine receptor D3
Type:
Mol. Mass.:
44243.43
Organism:
Homo sapiens (Human)
Description:
Residue:
400
  
Inhibitor
Name:
BDBM50177348
Synonyms:
1-(4-(4-(2-tert-butyl-6-(trifluoromethyl)pyrimidin-4-yl)piperazin-1-yl)butyl)-4-hydroxy-5-(trifluoromethyl)pyrimidin-2(1H)-one | CHEMBL382568
Type:
Small organic molecule
Emp. Form.:
C22H28F6N6O2
Mol. Mass.:
522.4871
SMILES:
CC(C)(C)c1nc(cc(n1)C(F)(F)F)N1CCN(CCCCn2cc(c(=O)[nH]c2=O)C(F)(F)F)CC1
: