Target
D(3) dopamine receptor
Ligand
BDBM50177345
Substrate
Meas. Tech.
ChEMBL_331690 (CHEMBL862890)
Ki
4.4±n/a nM
Citation
 Geneste, HBackfisch, GBraje, WDelzer, JHaupt, AHutchins, CWKing, LLKling, ATeschendorf, HJUnger, LWernet, W Synthesis and SAR of highly potent and selective dopamine D(3)-receptor antagonists: 1H-pyrimidin-2-one derivatives. Bioorg Med Chem Lett 16:490-4 (2005)  
Target
Name:
D(3) dopamine receptor
Synonyms:
DOPAMINE D3 DRD3_HUMAN Dopamine D3 receptor (D3) Dopamine receptor Dopamine receptor D3
Type:
Mol. Mass.:
44243.43
Organism:
Homo sapiens (Human)
Description:
Residue:
400
  
Inhibitor
Name:
BDBM50177345
Synonyms:
1-(4-(4-(2-tert-butyl-6-(trifluoromethyl)pyrimidin-4-yl)piperazin-1-yl)butyl)-4-methylpyrimidin-2(1H)-one | CHEMBL202253
Type:
Small organic molecule
Emp. Form.:
C22H31F3N6O
Mol. Mass.:
452.5163
SMILES:
Cc1ccn(CCCCN2CCN(CC2)c2cc(nc(n2)C(C)(C)C)C(F)(F)F)c(=O)n1
: