Target
D(3) dopamine receptor
Ligand
BDBM50177368
Substrate
Meas. Tech.
ChEMBL_329734 (CHEMBL864615)
Ki
51±n/a nM
Citation
 Chen, JDing, KLevant, BWang, S Design of novel hexahydropyrazinoquinolines as potent and selective dopamine D3 receptor ligands with improved solubility. Bioorg Med Chem Lett 16:443-6 (2005)  
Target
Name:
D(3) dopamine receptor
Synonyms:
DOPAMINE D3 Dopamine D3 receptor | Drd3
Type:
Protein
Mol. Mass.:
49540.58
Organism:
Rattus norvegicus (Rat)
Description:
P19020
Residue:
446
  
Inhibitor
Name:
BDBM50177368
Synonyms:
CHEMBL373052 | N-(trans-4-(2-(8-methoxy-1,2,4,4a,5,6-hexahydropyrazino[1,2-a]quinolin-3-yl)ethyl)cyclohexyl)quinoline-3-carboxamide
Type:
Small organic molecule
Emp. Form.:
C31H38N4O2
Mol. Mass.:
498.659
SMILES:
COc1ccc2N3CCN(CC[C@H]4CC[C@@H](CC4)NC(=O)c4cnc5ccccc5c4)CC3CCc2c1
: