Target
Cathepsin K
Ligand
BDBM19857
Substrate
Meas. Tech.
ChEMBL_325792 (CHEMBL862698)
Ki
2.3±n/a nM
Citation
 Palmer, JTBryant, CWang, DXDavis, DESetti, ELRydzewski, RMVenkatraman, STian, ZQBurrill, LCMendonca, RVSpringman, EMcCarter, JChung, TCheung, HJanc, JWMcGrath, MSomoza, JREnriquez, PYu, ZWStrickley, RMLiu, LVenuti, MCPercival, MDFalgueyret, JPPrasit, POballa, RRiendeau, DYoung, RNWesolowski, GRodan, SBJohnson, CKimmel, DBRodan, G Design and synthesis of tri-ring P3 benzamide-containing aminonitriles as potent, selective, orally effective inhibitors of cathepsin K. J Med Chem 48:7520-34 (2005)  
Target
Name:
Cathepsin K
Synonyms:
CATK_RABIT | CTSK
Type:
Enzyme
Mol. Mass.:
36879.51
Organism:
Oryctolagus cuniculus (rabbit)
Description:
Residue:
329
  
Inhibitor
Name:
BDBM19857
Synonyms:
N-{1-[(cyanomethyl)carbamoyl]cyclohexyl}-4-[2-(morpholin-4-yl)-1,3-thiazol-4-yl]benzamide | aryl-morpholino-containing analogue, 12
Type:
Small organic molecule
Emp. Form.:
C23H27N5O3S
Mol. Mass.:
453.557
SMILES:
O=C(NC1(CCCCC1)C(=O)NCC#N)c1ccc(cc1)-c1csc(n1)N1CCOCC1
: