Target
Adenosine receptor A1
Ligand
BDBM50080540
Substrate
Meas. Tech.
ChEMBL_339864 (CHEMBL862301)
Kd
4600±n/a nM
Citation
 Baraldi, PGPavani, MGLeung, EMoorman, ARVarani, KVincenzi, FBorea, PARomagnoli, R Synthesis and biological characterization of [3H] (2-amino-4,5,6,7-tetrahydrobenzo[b]thiophen-3-yl)-(4-chlorophenyl)-methanone, the first radiolabelled adenosine A1 allosteric enhancer. Bioorg Med Chem Lett 16:1402-4 (2006)  
Target
Name:
Adenosine receptor A1
Synonyms:
A1 adenosine receptor (hA1) AA1R_HUMAN ADORA1 Adenosine A1-receptor Adenosine receptor A1 (hA1) | Adenosine transporter (AdT)
Type:
G Protein-Coupled Receptor (GPCR)
Mol. Mass.:
36520.92
Organism:
Homo sapiens (Human)
Description:
P30542
Residue:
326
  
Inhibitor
Name:
BDBM50080540
Synonyms:
(2-Amino-4,5,6,7-tetrahydro-benzo[b]thiophen-3-yl)-(4-chloro-phenyl)-methanone CHEMBL203347 | CHEMBL57997
Type:
Small organic molecule
Emp. Form.:
C15H14ClNOS
Mol. Mass.:
291.796
SMILES:
Nc1sc2CCCCc2c1C(=O)c1ccc(Cl)cc1
: