Target
Epidermal growth factor receptor
Ligand
BDBM50178493
Substrate
Meas. Tech.
ChEMBL_331141 (CHEMBL862242)
IC50
12600±n/a nM
Citation
 Lee, KIPark, YPark, SJHwang, JHLee, SJKim, GDPark, WKLee, SJeong, DKong, JYKang, HKCho, H Naphthofuroquinone derivatives: inhibition of receptor tyrosine kinases. Bioorg Med Chem Lett 16:737-42 (2005)  
Target
Name:
Epidermal growth factor receptor
Synonyms:
EGF Receptor Substrate EGFR_HUMAN ERBB1 Epidermal Growth Factor Receptor erbB-1 Epidermal growth factor receptor (EGFR) HER1 Proto-oncogene c-ErbB-1 Tyrosine-Protein Kinase ErbB-1
Type:
Receptor Kinase Domain
Mol. Mass.:
134279.59
Organism:
Homo sapiens (Human)
Description:
P00533
Residue:
1210
  
Inhibitor
Name:
BDBM50178493
Synonyms:
5-methoxy-7,12-dioxo-7,12-dihydro-dinaphtho[1,2-b;2',3'-d]furan-6-carboxylic acid methyl ester | CHEMBL201840
Type:
Small organic molecule
Emp. Form.:
C23H14O6
Mol. Mass.:
386.3537
SMILES:
COC(=O)c1c(OC)c2ccccc2c2oc3c(C(=O)c4ccccc4C3=O)c12
: