Target
Delta-type opioid receptor
Ligand
BDBM50178761
Substrate
Meas. Tech.
ChEMBL_326438 (CHEMBL867596)
IC50
>10000±n/a nM
Citation
 Li, TFujita, YShiotani, KMiyazaki, ATsuda, YAmbo, ASasaki, YJinsmaa, YMarczak, EBryant, SDSalvadori, SLazarus, LHOkada, Y Potent Dmt-Tic pharmacophoric delta- and mu-opioid receptor antagonists. J Med Chem 48:8035-44 (2005)  
Target
Name:
Delta-type opioid receptor
Synonyms:
DOR-1 MSL-2 OPRD_MOUSE Oprd1
Type:
Enzyme Catalytic Domain
Mol. Mass.:
40577.25
Organism:
MOUSE
Description:
P32300
Residue:
372
  
Inhibitor
Name:
BDBM50178761
Synonyms:
3,6-bis(Dmt-Tic-NH-ethyl)-2(1H)-pyrazinone | CHEMBL198800
Type:
Small organic molecule
Emp. Form.:
C51H60N8O7
Mol. Mass.:
897.0715
SMILES:
Cc1cc(O)cc(C)c1C[C@H](N)C(=O)N1Cc2ccccc2CC1C(=O)NCCc1[nH]c(=O)c(CCNC(=O)C2Cc3ccccc3CN2C(=O)[C@@H](N)Cc2c(C)cc(O)cc2C)nc1C
: