Target
Mu-type opioid receptor
Ligand
BDBM50178755
Substrate
Meas. Tech.
ChEMBL_326441 (CHEMBL867599)
IC50
>10000±n/a nM
Citation
 Li, TFujita, YShiotani, KMiyazaki, ATsuda, YAmbo, ASasaki, YJinsmaa, YMarczak, EBryant, SDSalvadori, SLazarus, LHOkada, Y Potent Dmt-Tic pharmacophoric delta- and mu-opioid receptor antagonists. J Med Chem 48:8035-44 (2005)  
Target
Name:
Mu-type opioid receptor
Synonyms:
M-OR-1 Mu opioid receptor OPIATE Mu OPRM_CAVPO
Type:
Enzyme Catalytic Domain
Mol. Mass.:
11165.58
Organism:
GUINEA PIG
Description:
P97266
Residue:
98
  
Inhibitor
Name:
BDBM50178755
Synonyms:
3,6-bis(Dmt-Tic-NH-methyl)-2(1H)-pyrazinone | CHEMBL200890
Type:
Small organic molecule
Emp. Form.:
C49H56N8O7
Mol. Mass.:
869.0183
SMILES:
Cc1cc(O)cc(C)c1C[C@H](N)C(=O)N1Cc2ccccc2CC1C(=O)NCc1[nH]c(=O)c(CNC(=O)C2Cc3ccccc3CN2C(=O)[C@@H](N)Cc2c(C)cc(O)cc2C)nc1C
: