Target
Poly [ADP-ribose] polymerase 1
Ligand
BDBM50179066
Substrate
Meas. Tech.
ChEMBL_335752 (CHEMBL860595)
IC50
10000±n/a nM
Citation
 Wells, GJBihovsky, RHudkins, RLAtor, MAHusten, J Synthesis and structure-activity relationships of novel pyrrolocarbazole lactam analogs as potent and cell-permeable inhibitors of poly(ADP-ribose)polymerase-1 (PARP-1). Bioorg Med Chem Lett 16:1151-5 (2006)  
Target
Name:
Poly [ADP-ribose] polymerase 1
Synonyms:
(ARTD1 or PARP1) 2.4.2.30 ADPRT ARTD1 Human diphtheria toxin-like ADP-ribosyltransferase (ARTD1 or PARP1) NT-PARP-1 PARP1 PPOL Poly [ADP-ribose] polymerase 1 (PARP) Poly [ADP-ribose] polymerase 1 (PARP1) Poly [ADP-ribose] polymerase 1, 28-kDa form Poly [ADP-ribose] polymerase 1, processed C-terminus Poly [ADP-ribose] polymerase-1 Poly(ADP-ribose) polymerase-1 (ARTD1/PARP1) Protein poly-ADP-ribosyltransferase PARP1 | Synonyms=ADPRT
Type:
Mol. Mass.:
113114.22
Organism:
Homo sapiens (Human)
Description:
P09874
Residue:
1014
  
Inhibitor
Name:
BDBM50179066
Synonyms:
5,11-dimethyl-1,2,3,5,6,11-hexahydro-5,11-diaza-benzo[a]trinden-4-one | CHEMBL382430
Type:
Small organic molecule
Emp. Form.:
C19H18N2O
Mol. Mass.:
290.359
SMILES:
CN1Cc2c(C1=O)c1CCCc1c1n(C)c3ccccc3c21
: