Target
Platelet-derived growth factor receptor beta
Ligand
BDBM50179210
Substrate
Meas. Tech.
ChEMBL_325211 (CHEMBL861464)
IC50
9±n/a nM
Citation
 Ho, CYLudovici, DWMaharoof, USMei, JSechler, JLTuman, RWStrobel, EDAndraka, LYen, HKLeo, GLi, JAlmond, HLu, HDeVine, ATominovich, RMBaker, JEmanuel, SGruninger, RHMiddleton, SAJohnson, DLGalemmo, RA (6,7-Dimethoxy-2,4-dihydroindeno[1,2-c]pyrazol-3-yl)phenylamines: platelet-derived growth factor receptor tyrosine kinase inhibitors with broad antiproliferative activity against tumor cells. J Med Chem 48:8163-73 (2005)  
Target
Name:
Platelet-derived growth factor receptor beta
Synonyms:
Beta-type platelet-derived growth factor receptor CD140b antigen PDGF Receptor Substrate PDGFR PDGFR-1 PDGFRB PGFRB_HUMAN Platelet-derived growth factor receptor 1 Platelet-derived growth factor receptor beta (PDGFR-beta) Platelet-derived growth factor receptor beta (PDGFRbeta) | VHL/PDGFRB
Type:
Enzyme
Mol. Mass.:
123922.25
Organism:
Homo sapiens (Human)
Description:
P09619
Residue:
1106
  
Inhibitor
Name:
BDBM50179210
Synonyms:
(7-methoxy-2,4-dihydroindeno[1,2-c]pyrazol-3-yl)phenylamine | CHEMBL371949
Type:
Small organic molecule
Emp. Form.:
C17H15N3O
Mol. Mass.:
277.3205
SMILES:
COc1ccc2Cc3c(Nc4ccccc4)[nH]nc3-c2c1
: